Information card for entry 4025008
Common name | tetra(2,6-dimethyl-4-methoxyphenyl)pyrene |
Chemical name | tetra(2,6-dimethyl-4-methoxyphenyl)pyrene |
Formula | C70 H74 O4 |
Calculated formula | C70 H74 O4 |
SMILES | c1(cc(c2c3c1ccc1c(cc(c(c31)cc2)c1c(cc(OC)cc1C)C)c1c(cc(OC)cc1C)C)c1c(cc(OC)cc1C)C)c1c(cc(OC)cc1C)C.c1(cc(cc(c1)C)C)C.c1(cc(cc(c1)C)C)C |
Title of publication | Abundant Lattice Inclusion Phenomenon with Sterically Hindered and Inherently Shape-Selective Tetraarylpyrenes |
Authors of publication | Jarugu Narasimha Moorthy; Palani Natarajan; Paloth Venugopalan |
Journal of publication | Journal of Organic Chemistry |
Year of publication | 2009 |
Journal volume | 74 |
Pages of publication | 8566 - 8577 |
a | 12.918 ± 0.0014 Å |
b | 15.7692 ± 0.0018 Å |
c | 14.2495 ± 0.0015 Å |
α | 90° |
β | 106.017 ± 0.002° |
γ | 90° |
Cell volume | 2790 ± 0.5 Å3 |
Cell temperature | 100 ± 2 K |
Ambient diffraction temperature | 100 ± 2 K |
Number of distinct elements | 3 |
Space group number | 14 |
Hermann-Mauguin space group symbol | P 1 21/c 1 |
Hall space group symbol | -P 2ybc |
Residual factor for all reflections | 0.0751 |
Residual factor for significantly intense reflections | 0.0546 |
Weighted residual factors for significantly intense reflections | 0.1282 |
Weighted residual factors for all reflections included in the refinement | 0.1377 |
Goodness-of-fit parameter for all reflections included in the refinement | 1.03 |
Diffraction radiation wavelength | 0.71073 Å |
Diffraction radiation type | MoKα |