Information card for entry 4025013
Common name | tetra(2,6-dimethyl-4-methoxyphenyl)pyrene |
Chemical name | tetra(2,6-dimethyl-4-methoxyphenyl)pyrene |
Formula | C26 H25 O2 |
Calculated formula | C26 H25 O2 |
Title of publication | Abundant Lattice Inclusion Phenomenon with Sterically Hindered and Inherently Shape-Selective Tetraarylpyrenes |
Authors of publication | Jarugu Narasimha Moorthy; Palani Natarajan; Paloth Venugopalan |
Journal of publication | Journal of Organic Chemistry |
Year of publication | 2009 |
Journal volume | 74 |
Pages of publication | 8566 - 8577 |
a | 20.1544 ± 0.0014 Å |
b | 15.6127 ± 0.0011 Å |
c | 13.6631 ± 0.001 Å |
α | 90° |
β | 100.848 ± 0.001° |
γ | 90° |
Cell volume | 4222.5 ± 0.5 Å3 |
Cell temperature | 100 ± 2 K |
Ambient diffraction temperature | 100 ± 2 K |
Number of distinct elements | 3 |
Space group number | 14 |
Hermann-Mauguin space group symbol | P 1 21/c 1 |
Hall space group symbol | -P 2ybc |
Residual factor for all reflections | 0.1011 |
Residual factor for significantly intense reflections | 0.0672 |
Weighted residual factors for significantly intense reflections | 0.1666 |
Weighted residual factors for all reflections included in the refinement | 0.1838 |
Goodness-of-fit parameter for all reflections included in the refinement | 1.053 |
Diffraction radiation wavelength | 0.71073 Å |
Diffraction radiation type | MoKα |