Information card for entry 4025016
Common name | tetra(2,6-dimethyl-4-methoxybenzyl)pyrene |
Chemical name | tetra(2,6-dimethyl-4-methoxybenzyl)pyrene |
Formula | C92 H124 O4 |
Calculated formula | C92 H124 O4 |
Title of publication | Abundant Lattice Inclusion Phenomenon with Sterically Hindered and Inherently Shape-Selective Tetraarylpyrenes |
Authors of publication | Jarugu Narasimha Moorthy; Palani Natarajan; Paloth Venugopalan |
Journal of publication | Journal of Organic Chemistry |
Year of publication | 2009 |
Journal volume | 74 |
Pages of publication | 8566 - 8577 |
a | 17.038 ± 0.001 Å |
b | 22.0085 ± 0.0013 Å |
c | 21.7584 ± 0.0012 Å |
α | 90° |
β | 110.527 ± 0.001° |
γ | 90° |
Cell volume | 7640.9 ± 0.8 Å3 |
Cell temperature | 100 ± 2 K |
Ambient diffraction temperature | 100 ± 2 K |
Number of distinct elements | 3 |
Space group number | 14 |
Hermann-Mauguin space group symbol | P 1 21/n 1 |
Hall space group symbol | -P 2yn |
Residual factor for all reflections | 0.174 |
Residual factor for significantly intense reflections | 0.0929 |
Weighted residual factors for significantly intense reflections | 0.2008 |
Weighted residual factors for all reflections included in the refinement | 0.2349 |
Goodness-of-fit parameter for all reflections included in the refinement | 1.065 |
Diffraction radiation wavelength | 0.71073 Å |
Diffraction radiation type | MoKα |