Information card for entry 4025045
Formula | C51 H89 N15 O25 |
Calculated formula | C51 H75 N15 O25 |
SMILES | [NH2+]1Cc2nc(ccc2)C[NH2+]Cc2c(c3C[NH2+]Cc4nc(ccc4)C[NH2+]Cc4c(c(C1)c(c(c4CC)C[NH2+]Cc1nc(ccc1)C[NH2+]Cc(c3CC)c2CC)CC)CC)CC.N(=O)(=O)[O-].N(=O)(=O)[O-].N(=O)(=O)[O-].N(=O)(=O)[O-].N(=O)(=O)[O-].N(=O)(=O)[O-].O.O.O.O.O.O.O |
Title of publication | Polyaza Cryptand Receptor Selective for Dihydrogen Phosphate |
Authors of publication | Pedro Mateus; Rita Delgado; Paula Brandão; Vítor Félix |
Journal of publication | Journal of Organic Chemistry |
Year of publication | 2009 |
Journal volume | 74 |
Pages of publication | 8638 - 8646 |
a | 12.17 ± 0.02 Å |
b | 17.79 ± 0.03 Å |
c | 29.23 ± 0.05 Å |
α | 90° |
β | 90° |
γ | 90° |
Cell volume | 6328 ± 18 Å3 |
Cell temperature | 150 ± 2 K |
Ambient diffraction temperature | 150 ± 2 K |
Number of distinct elements | 4 |
Space group number | 19 |
Hermann-Mauguin space group symbol | P 21 21 21 |
Hall space group symbol | P 2ac 2ab |
Residual factor for all reflections | 0.124 |
Residual factor for significantly intense reflections | 0.0729 |
Weighted residual factors for significantly intense reflections | 0.1847 |
Weighted residual factors for all reflections included in the refinement | 0.2109 |
Goodness-of-fit parameter for all reflections included in the refinement | 1.021 |
Diffraction radiation wavelength | 0.71073 Å |
Diffraction radiation type | MoKα |