Information card for entry 4025096
Formula | C20 H36 O3 |
Calculated formula | C20 H36 O3 |
SMILES | O[C@H]1[C@H]2[C@@]3(O)[C@@H](C[C@H]1CO)[C@H](CC[C@H]([C@@H]2CC[C@@H]3C)C)C(C)C.O[C@@H]1[C@@H]2[C@]3(O)[C@H](C[C@@H]1CO)[C@@H](CC[C@@H]([C@H]2CC[C@H]3C)C)C(C)C |
Title of publication | Toward the Total Synthesis of Vinigrol: Synthesis of epi-C-8-Dihydrovinigrol |
Authors of publication | Lionel Gentric; Xavier Le Goff; Louis Ricard; Issam Hanna |
Journal of publication | Journal of Organic Chemistry |
Year of publication | 2009 |
Journal volume | 74 |
Pages of publication | 9337 - 9344 |
a | 9.457 ± 0.001 Å |
b | 13.107 ± 0.001 Å |
c | 28.175 ± 0.001 Å |
α | 90° |
β | 90° |
γ | 90° |
Cell volume | 3492.4 ± 0.5 Å3 |
Cell temperature | 150 ± 0.1 K |
Ambient diffraction temperature | 150 ± 0.1 K |
Number of distinct elements | 3 |
Space group number | 61 |
Hermann-Mauguin space group symbol | P b c a |
Hall space group symbol | -P 2ac 2ab |
Residual factor for all reflections | 0.0932 |
Residual factor for significantly intense reflections | 0.0449 |
Weighted residual factors for significantly intense reflections | 0.1 |
Weighted residual factors for all reflections included in the refinement | 0.1134 |
Goodness-of-fit parameter for all reflections included in the refinement | 1.006 |
Diffraction radiation wavelength | 0.71069 Å |
Diffraction radiation type | MoKα |