Information card for entry 4028911
Formula | C15 H20 N2 O4 |
Calculated formula | C15 H20 N2 O4 |
SMILES | N1(Cc2ccc(OC)cc2)C(=O)CC[C@H](O)[C@@H]1NC(=O)C |
Title of publication | Diastereoselective Ritter Reactions of Chiral CyclicN-Acyliminium Ions: Synthesis of Pyrido- and Pyrrolo[2,3-d]oxazoles and 4-Hydroxy-5-N-acylaminopyrrolidines and 5-Hydroxy-6-N-acylaminopiperidines |
Authors of publication | Morgan, Ian R.; Yazici, Arife; Pyne, Stephen G.; Skelton, Brian W. |
Journal of publication | The Journal of Organic Chemistry |
Year of publication | 2008 |
Journal volume | 73 |
Journal issue | 7 |
Pages of publication | 2943 - 2946 |
a | 9.2974 ± 0.0004 Å |
b | 7.5545 ± 0.0002 Å |
c | 10.728 ± 0.0004 Å |
α | 90° |
β | 102.224 ± 0.004° |
γ | 90° |
Cell volume | 736.42 ± 0.05 Å3 |
Cell temperature | 100 ± 2 K |
Ambient diffraction temperature | 100 ± 2 K |
Number of distinct elements | 4 |
Space group number | 4 |
Hermann-Mauguin space group symbol | P 1 21 1 |
Hall space group symbol | P 2yb |
Residual factor for all reflections | 0.0569 |
Residual factor for significantly intense reflections | 0.0393 |
Weighted residual factors for significantly intense reflections | 0.0753 |
Weighted residual factors for all reflections included in the refinement | 0.0801 |
Goodness-of-fit parameter for all reflections included in the refinement | 0.968 |
Diffraction radiation wavelength | 0.71073 Å |
Diffraction radiation type | MoKα |