Information card for entry 4028915
Chemical name | (R)-5-Methyl-2,3-piperazynodione |
Formula | C5 H8 N2 O2 |
Calculated formula | C5 H8 N2 O2 |
SMILES | O=C1NC[C@H](NC1=O)C |
Title of publication | Conformational Properties, Chiroptical Spectra, and Molecular Self-Assembly of 2,3-Piperazinodiones and Their Dithiono Analogues |
Authors of publication | Piotrkowska, Barbara; Myślińska, Małgorzata; Gdaniec, Maria; Herman, Aleksander; Połoński, Tadeusz |
Journal of publication | The Journal of Organic Chemistry |
Year of publication | 2008 |
Journal volume | 73 |
Journal issue | 7 |
Pages of publication | 2852 - 2861 |
a | 6.981 ± 0.0001 Å |
b | 6.981 ± 0.0001 Å |
c | 24.2018 ± 0.0007 Å |
α | 90° |
β | 90° |
γ | 90° |
Cell volume | 1179.46 ± 0.04 Å3 |
Cell temperature | 293 ± 2 K |
Ambient diffraction temperature | 293 ± 2 K |
Number of distinct elements | 4 |
Space group number | 96 |
Hermann-Mauguin space group symbol | P 43 21 2 |
Hall space group symbol | P 4nw 2abw |
Residual factor for all reflections | 0.0316 |
Residual factor for significantly intense reflections | 0.0282 |
Weighted residual factors for significantly intense reflections | 0.0702 |
Weighted residual factors for all reflections included in the refinement | 0.0736 |
Goodness-of-fit parameter for all reflections included in the refinement | 1.102 |
Diffraction radiation wavelength | 0.71073 Å |
Diffraction radiation type | MoKα |