Information card for entry 4028917
Common name | 148C |
Chemical name | (R)-1,4,5-Trimethyl-2,3-piperazinodithione |
Formula | C7 H12 N2 S2 |
Calculated formula | C7 H12 N2 S2 |
SMILES | S=C1N(C[C@H](N(C1=S)C)C)C |
Title of publication | Conformational Properties, Chiroptical Spectra, and Molecular Self-Assembly of 2,3-Piperazinodiones and Their Dithiono Analogues |
Authors of publication | Piotrkowska, Barbara; Myślińska, Małgorzata; Gdaniec, Maria; Herman, Aleksander; Połoński, Tadeusz |
Journal of publication | The Journal of Organic Chemistry |
Year of publication | 2008 |
Journal volume | 73 |
Journal issue | 7 |
Pages of publication | 2852 - 2861 |
a | 6.403 ± 0.0012 Å |
b | 11.526 ± 0.002 Å |
c | 12.735 ± 0.003 Å |
α | 90° |
β | 90° |
γ | 90° |
Cell volume | 939.9 ± 0.3 Å3 |
Cell temperature | 140 ± 2 K |
Ambient diffraction temperature | 140 ± 2 K |
Number of distinct elements | 4 |
Space group number | 19 |
Hermann-Mauguin space group symbol | P 21 21 21 |
Hall space group symbol | P 2ac 2ab |
Residual factor for all reflections | 0.0422 |
Residual factor for significantly intense reflections | 0.0402 |
Weighted residual factors for significantly intense reflections | 0.0936 |
Weighted residual factors for all reflections included in the refinement | 0.0949 |
Goodness-of-fit parameter for all reflections included in the refinement | 1.103 |
Diffraction radiation wavelength | 0.71073 Å |
Diffraction radiation type | MoKα |