Information card for entry 4030759
Formula | Mo5 O16 U0.75 |
Calculated formula | Mo5 O16 U0.75 |
Title of publication | The crystal structures of UMo5O16 and U0.75Mo5O16 studies by X-ray diffraction and high-resolution electron microscopy |
Authors of publication | Tabachenko, V. V.; D Yachenko, O. G.; Sundberg, M. |
Journal of publication | European Journal of Solid State and Inorganic Chemistry |
Year of publication | 1995 |
Journal volume | 32 |
Pages of publication | 1137 - 1149 |
a | 9.9 ± 0.0008 Å |
b | 7.1889 ± 0.0006 Å |
c | 4.1074 ± 0.0004 Å |
α | 90° |
β | 90° |
γ | 90° |
Cell volume | 292.32 ± 0.04 Å3 |
Ambient diffraction temperature | 293 K |
Number of distinct elements | 3 |
Space group number | 16 |
Hermann-Mauguin space group symbol | P 2 2 2 |
Hall space group symbol | P 2 2 |
Residual factor for significantly intense reflections | 0.056 |
Weighted residual factors for significantly intense reflections | 0.048 |
Diffraction radiation probe | x-ray |
Diffraction radiation wavelength | 0.71073 Å |
Diffraction radiation type | MoKα |