Information card for entry 4033676
Formula | C7 H4 I N3 |
Calculated formula | C7 H4 I N3 |
SMILES | Ic1nc2c(nn1)cccc2 |
Title of publication | 3-Substituted Benzo[ e][1,2,4]triazines: Synthesis and Electronic Effects of the C(3) Substituent. |
Authors of publication | Bodzioch, Agnieszka; Pomikło, Dominika; Celeda, Małgorzata; Pietrzak, Anna; Kaszyński, Piotr |
Journal of publication | The Journal of organic chemistry |
Year of publication | 2019 |
Journal volume | 84 |
Journal issue | 10 |
Pages of publication | 6377 - 6394 |
a | 4.3901 ± 0.0001 Å |
b | 13.329 ± 0.0003 Å |
c | 12.9278 ± 0.0003 Å |
α | 90° |
β | 99.754 ± 0.002° |
γ | 90° |
Cell volume | 745.54 ± 0.03 Å3 |
Cell temperature | 100 ± 1 K |
Ambient diffraction temperature | 100 ± 1 K |
Number of distinct elements | 4 |
Space group number | 14 |
Hermann-Mauguin space group symbol | P 1 21/c 1 |
Hall space group symbol | -P 2ybc |
Residual factor for all reflections | 0.0321 |
Residual factor for significantly intense reflections | 0.0307 |
Weighted residual factors for significantly intense reflections | 0.0793 |
Weighted residual factors for all reflections included in the refinement | 0.0805 |
Goodness-of-fit parameter for all reflections included in the refinement | 1.052 |
Diffraction radiation wavelength | 1.54184 Å |
Diffraction radiation type | CuKα |