Information card for entry 4033710
Formula | C24 H23 Fe N O |
Calculated formula | C24 H23 Fe N O |
SMILES | [Fe]12345678([c]9%10[cH]3[cH]1[cH]4[c]29CC[C@]1%10N(C(=O)CC1)C(=C)c1ccccc1)[cH]1[cH]7[cH]6[cH]5[cH]81 |
Title of publication | Simultaneous Construction of Planar and Central Chiralities as Well as Unprecedented Axial Chirality on and around a Ferrocene Backbone. |
Authors of publication | Li, Hongjie; Jia, Peijing; Qian, Naixin; Li, Shasha; Jiao, Peng |
Journal of publication | The Journal of organic chemistry |
Year of publication | 2019 |
Journal volume | 84 |
Journal issue | 5 |
Pages of publication | 2817 - 2828 |
a | 10.53 ± 0.0003 Å |
b | 7.9937 ± 0.0003 Å |
c | 11.1625 ± 0.0003 Å |
α | 90° |
β | 91.636 ± 0.003° |
γ | 90° |
Cell volume | 939.21 ± 0.05 Å3 |
Cell temperature | 100.01 ± 0.1 K |
Ambient diffraction temperature | 100.01 ± 0.1 K |
Number of distinct elements | 5 |
Space group number | 4 |
Hermann-Mauguin space group symbol | P 1 21 1 |
Hall space group symbol | P 2yb |
Residual factor for all reflections | 0.0355 |
Residual factor for significantly intense reflections | 0.0329 |
Weighted residual factors for significantly intense reflections | 0.0653 |
Weighted residual factors for all reflections included in the refinement | 0.0669 |
Goodness-of-fit parameter for all reflections included in the refinement | 1.0479 |
Diffraction radiation probe | x-ray |
Diffraction radiation wavelength | 0.71073 Å |
Diffraction radiation type | MoKα |