Information card for entry 4033781
Formula | C28 H40 N8 Pd |
Calculated formula | C28 H40 N8 Pd |
Title of publication | Palladium-Catalyzed C-N Bond Cleavage of 2 H-Azirines for the Synthesis of Functionalized α-Amido Ketones. |
Authors of publication | Xu, Fen; Si, Xiao-Ju; Song, Yuan-Yuan; Wang, Xing-Dong; Liu, Chun-Sen; Geng, Peng-Fei; Du, Miao |
Journal of publication | The Journal of organic chemistry |
Year of publication | 2019 |
Journal volume | 84 |
Journal issue | 4 |
Pages of publication | 2200 - 2208 |
a | 9.9466 ± 0.001 Å |
b | 11.2291 ± 0.0005 Å |
c | 11.3124 ± 0.0006 Å |
α | 90.294 ± 0.004° |
β | 112.968 ± 0.009° |
γ | 96.803 ± 0.006° |
Cell volume | 1153.32 ± 0.16 Å3 |
Cell temperature | 293 ± 2 K |
Ambient diffraction temperature | 293 ± 2 K |
Number of distinct elements | 4 |
Space group number | 2 |
Hermann-Mauguin space group symbol | P -1 |
Hall space group symbol | -P 1 |
Residual factor for all reflections | 0.0636 |
Residual factor for significantly intense reflections | 0.0536 |
Weighted residual factors for significantly intense reflections | 0.1566 |
Weighted residual factors for all reflections included in the refinement | 0.1671 |
Goodness-of-fit parameter for all reflections included in the refinement | 1.083 |
Diffraction radiation probe | x-ray |
Diffraction radiation wavelength | 1.54184 Å |
Diffraction radiation type | CuKα |