Information card for entry 4033814
Common name | 9-phosphatriptycene |
Chemical name | 10H-5,10-[1,2]benzenoacridophosphine |
Formula | C19 H13 P |
Calculated formula | C19 H13 P |
Title of publication | Complementary Synthetic Approaches toward 9-Phosphatriptycene and Structure-Reactivity Investigations of Its Association with Sterically Hindered Lewis Acids. |
Authors of publication | Hu, Lei; Mahaut, Damien; Tumanov, Nikolay; Wouters, Johan; Robiette, Raphaël; Berionni, Guillaume |
Journal of publication | The Journal of organic chemistry |
Year of publication | 2019 |
Journal volume | 84 |
Journal issue | 17 |
Pages of publication | 11268 - 11274 |
a | 14.8144 ± 0.001 Å |
b | 8.1417 ± 0.0003 Å |
c | 13.0081 ± 0.0009 Å |
α | 90° |
β | 120.325 ± 0.01° |
γ | 90° |
Cell volume | 1354.3 ± 0.2 Å3 |
Cell temperature | 100 ± 2 K |
Ambient diffraction temperature | 100 ± 2 K |
Number of distinct elements | 3 |
Space group number | 9 |
Hermann-Mauguin space group symbol | C 1 c 1 |
Hall space group symbol | C -2yc |
Residual factor for all reflections | 0.0371 |
Residual factor for significantly intense reflections | 0.034 |
Weighted residual factors for significantly intense reflections | 0.0806 |
Weighted residual factors for all reflections included in the refinement | 0.0831 |
Goodness-of-fit parameter for all reflections included in the refinement | 1.062 |
Diffraction radiation wavelength | 0.71073 Å |
Diffraction radiation type | MoKα |