Information card for entry 4033910
Formula | C21 H32 Br N O Si |
Calculated formula | C21 H32 Br N O Si |
SMILES | C1(=CC[C@H](O[Si](C)(C)C(C)(C)C)C[C@H]1N[C@H]1CCc2ccccc12)Br |
Title of publication | Application of Electrocyclic Ring-Opening and Desymmetrizing Nucleophilic Trappings of meso-6,6-Dibromobicyclo[3.1.0]hexanes to Total Syntheses of Crinine and Haemanthamine Alkaloids. |
Authors of publication | Lan, Ping; Banwell, Martin G.; Willis, Anthony C. |
Journal of publication | The Journal of organic chemistry |
Year of publication | 2019 |
Journal volume | 84 |
Journal issue | 6 |
Pages of publication | 3431 - 3466 |
a | 10.8031 ± 0.0002 Å |
b | 7.9845 ± 0.0001 Å |
c | 25.7942 ± 0.0004 Å |
α | 90° |
β | 90.498 ± 0.0007° |
γ | 90° |
Cell volume | 2224.86 ± 0.06 Å3 |
Cell temperature | 200 K |
Ambient diffraction temperature | 200 K |
Number of distinct elements | 6 |
Space group number | 4 |
Hermann-Mauguin space group symbol | P 1 21 1 |
Hall space group symbol | P 2yb |
Residual factor for all reflections | 0.0571 |
Residual factor for significantly intense reflections | 0.0367 |
Weighted residual factors for all reflections | 0.0678 |
Weighted residual factors for significantly intense reflections | 0.0626 |
Weighted residual factors for all reflections included in the refinement | 0.0678 |
Goodness-of-fit parameter for all reflections included in the refinement | 0.9702 |
Diffraction radiation wavelength | 0.71073 Å |
Diffraction radiation type | MoKα |