Information card for entry 4033934
Formula | C11 H8 Br Cl O2 |
Calculated formula | C11 H8 Br Cl O2 |
SMILES | BrC1=C(OCCC1=O)c1ccccc1Cl |
Title of publication | Metal-Free Brønsted Acid-Catalyzed Rearrangement of δ-Hydroxyalkynones to 2,3-Dihydro-4 H-pyran-4-ones: Total Synthesis of Obolactone and a Catechol Pyran Isolated from Plectranthus sylvestris. |
Authors of publication | Gholap, Sachin P.; Jangid, Dashrath; Fernandes, Rodney A. |
Journal of publication | The Journal of organic chemistry |
Year of publication | 2019 |
Journal volume | 84 |
Journal issue | 6 |
Pages of publication | 3537 - 3551 |
a | 10.7391 ± 0.0004 Å |
b | 7.356 ± 0.0003 Å |
c | 13.5262 ± 0.0004 Å |
α | 90° |
β | 90.473 ± 0.003° |
γ | 90° |
Cell volume | 1068.49 ± 0.07 Å3 |
Cell temperature | 150 K |
Ambient diffraction temperature | 150 K |
Number of distinct elements | 5 |
Space group number | 14 |
Hermann-Mauguin space group symbol | P 1 21/c 1 |
Hall space group symbol | -P 2ybc |
Residual factor for all reflections | 0.0247 |
Residual factor for significantly intense reflections | 0.0213 |
Weighted residual factors for significantly intense reflections | 0.052 |
Weighted residual factors for all reflections included in the refinement | 0.0536 |
Goodness-of-fit parameter for all reflections included in the refinement | 1.06 |
Diffraction radiation probe | x-ray |
Diffraction radiation wavelength | 0.71073 Å |
Diffraction radiation type | MoKα |