Information card for entry 4033980
Formula | C36 H33 Cl N2 O2 |
Calculated formula | C36 H33 Cl N2 O2 |
SMILES | c1ccccc1CN1C(=O)[C@@]2(c3cc(C)ccc13)[C@H](C(=O)c1ccc(C)cc1)[C@H]1CCCN1[C@@H]2c1ccccc1Cl.c1ccccc1CN1C(=O)[C@]2(c3cc(C)ccc13)[C@@H](C(=O)c1ccc(C)cc1)[C@@H]1CCCN1[C@H]2c1ccccc1Cl |
Title of publication | Synthesis of 7'-Arylidenespiro[indoline-3,1'-pyrrolizines] and 7'-Arylidenespiro[indene-2,1'-pyrrolizines] via [3 + 2] Cycloaddition and β-C-H Functionalized Pyrrolidine. |
Authors of publication | Huang, Ying; Fang, Hui-Lin; Huang, Yi-Xin; Sun, Jing; Yan, Chao-Guo |
Journal of publication | The Journal of organic chemistry |
Year of publication | 2019 |
Journal volume | 84 |
Journal issue | 19 |
Pages of publication | 12437 - 12451 |
a | 10.215 ± 0.004 Å |
b | 12.438 ± 0.005 Å |
c | 13.289 ± 0.004 Å |
α | 66.026 ± 0.011° |
β | 87.403 ± 0.012° |
γ | 73.883 ± 0.012° |
Cell volume | 1477.7 ± 1 Å3 |
Cell temperature | 296 ± 2 K |
Ambient diffraction temperature | 296 ± 2 K |
Number of distinct elements | 5 |
Space group number | 2 |
Hermann-Mauguin space group symbol | P -1 |
Hall space group symbol | -P 1 |
Residual factor for all reflections | 0.2721 |
Residual factor for significantly intense reflections | 0.0956 |
Weighted residual factors for significantly intense reflections | 0.1976 |
Weighted residual factors for all reflections included in the refinement | 0.259 |
Goodness-of-fit parameter for all reflections included in the refinement | 0.986 |
Diffraction radiation wavelength | 0.71073 Å |
Diffraction radiation type | MoKα |