Information card for entry 4034044
Formula | C36 H36 |
Calculated formula | C36 H36 |
SMILES | [C@H]12c3ccc(cc3[C@H](c3ccccc13)[C@H]1c3c([C@@H]2c2c1cc(cc2)C(C)(C)C)cccc3)C(C)(C)C |
Title of publication | Synthesis and Photodimerization of 2- and 2,3-Disubstituted Anthracenes: Influence of Steric Interactions and London Dispersion on Diastereoselectivity. |
Authors of publication | Geiger, Thomas; Haupt, Anne; Maichle-Mössmer, Cäcilia; Schrenk, Claudio; Schnepf, Andreas; Bettinger, Holger F. |
Journal of publication | The Journal of organic chemistry |
Year of publication | 2019 |
Journal volume | 84 |
Journal issue | 16 |
Pages of publication | 10120 - 10135 |
a | 30.492 ± 0.003 Å |
b | 6.8073 ± 0.0008 Å |
c | 12.6172 ± 0.0014 Å |
α | 90° |
β | 90.618 ± 0.002° |
γ | 90° |
Cell volume | 2618.8 ± 0.5 Å3 |
Cell temperature | 100 ± 2 K |
Ambient diffraction temperature | 100 ± 2 K |
Number of distinct elements | 2 |
Space group number | 5 |
Hermann-Mauguin space group symbol | C 1 2 1 |
Hall space group symbol | C 2y |
Residual factor for all reflections | 0.0422 |
Residual factor for significantly intense reflections | 0.0377 |
Weighted residual factors for significantly intense reflections | 0.0933 |
Weighted residual factors for all reflections included in the refinement | 0.0968 |
Goodness-of-fit parameter for all reflections included in the refinement | 1.035 |
Diffraction radiation wavelength | 0.71073 Å |
Diffraction radiation type | MoKα |