Information card for entry 4034132
Formula | C22 H32 B O2 P |
Calculated formula | C22 H32 B O2 P |
SMILES | [P@@](O)([BH3])(c1ccccc1c1c(O)cccc1)[C@H]1[C@@H](CC[C@H](C1)C)C(C)C |
Title of publication | Functional Phosphine Derivatives Having Stationary and Flexible Chiralities: Their Preparation and Chirality Controlling. |
Authors of publication | Zhang, Yu; Nie, Shao-Zhen; Ye, Jing-Jing; Wang, Ji-Ping; Zhou, Meng-Meng; Zhao, Chang-Qiu; Li, Qiang |
Journal of publication | The Journal of organic chemistry |
Year of publication | 2019 |
Journal volume | 84 |
Journal issue | 13 |
Pages of publication | 8423 - 8439 |
a | 8.5527 ± 0.0007 Å |
b | 13.8487 ± 0.0011 Å |
c | 18.3984 ± 0.0016 Å |
α | 90° |
β | 90° |
γ | 90° |
Cell volume | 2179.2 ± 0.3 Å3 |
Cell temperature | 298 ± 2 K |
Ambient diffraction temperature | 298 ± 2 K |
Number of distinct elements | 5 |
Space group number | 19 |
Hermann-Mauguin space group symbol | P 21 21 21 |
Hall space group symbol | P 2ac 2ab |
Residual factor for all reflections | 0.061 |
Residual factor for significantly intense reflections | 0.04 |
Weighted residual factors for significantly intense reflections | 0.086 |
Weighted residual factors for all reflections included in the refinement | 0.0956 |
Goodness-of-fit parameter for all reflections included in the refinement | 1.076 |
Diffraction radiation wavelength | 0.71073 Å |
Diffraction radiation type | MoKα |