Information card for entry 4034152
Formula | C43 H39 B Cl6 F2 N2 O8 |
Calculated formula | C43 H39 B Cl6 F2 N2 O8 |
Title of publication | Ion-Pairing Assemblies Comprising Anion Complexes of π-Extended Anion-Responsive Molecules. |
Authors of publication | Sugiura, Shinya; Matsuda, Wakana; Zhang, Wanying; Seki, Shu; Yasuda, Nobuhiro; Maeda, Hiromitsu |
Journal of publication | The Journal of organic chemistry |
Year of publication | 2019 |
Journal volume | 84 |
Journal issue | 14 |
Pages of publication | 8886 - 8898 |
a | 19.7722 ± 0.0009 Å |
b | 21.744 ± 0.0009 Å |
c | 10.5225 ± 0.0005 Å |
α | 90° |
β | 104.462 ± 0.003° |
γ | 90° |
Cell volume | 4380.6 ± 0.3 Å3 |
Cell temperature | 90 ± 2 K |
Ambient diffraction temperature | 90 ± 2 K |
Number of distinct elements | 7 |
Space group number | 14 |
Hermann-Mauguin space group symbol | P 1 21/c 1 |
Hall space group symbol | -P 2ybc |
Residual factor for all reflections | 0.1579 |
Residual factor for significantly intense reflections | 0.0753 |
Weighted residual factors for significantly intense reflections | 0.178 |
Weighted residual factors for all reflections included in the refinement | 0.2195 |
Goodness-of-fit parameter for all reflections included in the refinement | 0.938 |
Diffraction radiation wavelength | 0.78192 Å |
Diffraction radiation type | Synchrotron |