Information card for entry 4034163
Formula | C32 H38 O8 |
Calculated formula | C32 H38 O8 |
Title of publication | Diverse Chemosensitizing 8,9-Secolindenane-Type Sesquiterpenoid Oligomers and Monomers from <i>Sarcandra glabra</i>. |
Authors of publication | Chi, Jun; Wei, Shanshan; Gao, Hongliang; Xu, Dingqiao; Zhang, Lina; Yang, Lei; Xu, Wenjun; Luo, Jun; Kong, Lingyi |
Journal of publication | The Journal of organic chemistry |
Year of publication | 2019 |
Journal volume | 84 |
Journal issue | 14 |
Pages of publication | 9117 - 9126 |
a | 7.51 ± 0.005 Å |
b | 35.163 ± 0.011 Å |
c | 10.914 ± 0.003 Å |
α | 90° |
β | 91.743 ± 0.014° |
γ | 90° |
Cell volume | 2881 ± 2 Å3 |
Cell temperature | 220 K |
Ambient diffraction temperature | 220 K |
Number of distinct elements | 3 |
Space group number | 4 |
Hermann-Mauguin space group symbol | P 1 21 1 |
Hall space group symbol | P 2yb |
Residual factor for all reflections | 0.0684 |
Residual factor for significantly intense reflections | 0.0473 |
Weighted residual factors for significantly intense reflections | 0.1044 |
Weighted residual factors for all reflections included in the refinement | 0.1157 |
Goodness-of-fit parameter for all reflections included in the refinement | 1.024 |
Diffraction radiation wavelength | 1.54178 Å |
Diffraction radiation type | CuKα |