Information card for entry 4034169
Formula | C20 H37 N3 |
Calculated formula | C20 H37 N3 |
SMILES | n1(C(C)C)c(C)c(nc1C1N(C(CC1(C)C)(C)C)C(C)(C)C)C |
Title of publication | Influence of <i>N</i>-Substitution on the Formation and Oxidation of NHC-CAAC-Derived Triazaalkenes. |
Authors of publication | Mandal, Debdeep; Dolai, Ramapada; Kumar, Ravi; Suhr, Simon; Chrysochos, Nicolas; Kalita, Pankaj; Narayanan, Ramakirushnan Suriya; Rajaraman, Gopalan; Schulzke, Carola; Sarkar, Biprajit; Chandrasekhar, Vadapalli; Jana, Anukul |
Journal of publication | The Journal of organic chemistry |
Year of publication | 2019 |
Journal volume | 84 |
Journal issue | 14 |
Pages of publication | 8899 - 8909 |
a | 11.416 ± 0.002 Å |
b | 14.042 ± 0.003 Å |
c | 12.413 ± 0.003 Å |
α | 90° |
β | 95.89 ± 0.03° |
γ | 90° |
Cell volume | 1979.3 ± 0.7 Å3 |
Cell temperature | 170 ± 2 K |
Ambient diffraction temperature | 170 ± 2 K |
Number of distinct elements | 3 |
Space group number | 14 |
Hermann-Mauguin space group symbol | P 1 21/n 1 |
Hall space group symbol | -P 2yn |
Residual factor for all reflections | 0.1269 |
Residual factor for significantly intense reflections | 0.0576 |
Weighted residual factors for significantly intense reflections | 0.1303 |
Weighted residual factors for all reflections included in the refinement | 0.1566 |
Goodness-of-fit parameter for all reflections included in the refinement | 0.912 |
Diffraction radiation wavelength | 0.71073 Å |
Diffraction radiation type | MoKα |