Information card for entry 4034356
Formula | C18 H17 N S |
Calculated formula | C18 H17 N S |
Title of publication | Game of Isomers: Bifurcation in the Catalytic Formation of Bis[1]benzothieno[1,4]thiazines with Conformation-Dependent Electronic Properties. |
Authors of publication | Schneeweis, Arno P. W.; Hauer, Simone T.; Lopez, Daniel A.; von Dressler, Björn; Reiss, Guido J.; Müller, Thomas J J |
Journal of publication | The Journal of organic chemistry |
Year of publication | 2019 |
Journal volume | 84 |
Journal issue | 9 |
Pages of publication | 5582 - 5595 |
a | 6.1973 ± 0.0005 Å |
b | 31.092 ± 0.003 Å |
c | 7.8625 ± 0.0007 Å |
α | 90° |
β | 98.747 ± 0.007° |
γ | 90° |
Cell volume | 1497.4 ± 0.2 Å3 |
Cell temperature | 290 ± 2 K |
Ambient diffraction temperature | 290 ± 2 K |
Number of distinct elements | 4 |
Space group number | 14 |
Hermann-Mauguin space group symbol | P 1 21/n 1 |
Hall space group symbol | -P 2yn |
Residual factor for all reflections | 0.1695 |
Residual factor for significantly intense reflections | 0.0659 |
Weighted residual factors for significantly intense reflections | 0.0803 |
Weighted residual factors for all reflections included in the refinement | 0.1063 |
Goodness-of-fit parameter for all reflections included in the refinement | 0.998 |
Diffraction radiation wavelength | 0.71073 Å |
Diffraction radiation type | MoKα |