Information card for entry 4034377
Formula | C24 H23 B F2 N4 O S |
Calculated formula | C24 H23 B F2 N4 O S |
SMILES | CN(C)c1ccc(cc1)C1=Nc2sc3c(ccc(c3)c3ccc(cc3)N(C)C)[n]2[B](O1)(F)F |
Title of publication | Application of the Suzuki-Miyaura Reaction for the Postfunctionalization of the Benzo[4,5]thiazolo[3,2- c][1,3,5,2]oxadiazaborinine Core: An Approach toward Fluorescent Dyes. |
Authors of publication | Potopnyk, Mykhaylo A.; Volyniuk, Dmytro; Luboradzki, Roman; Ceborska, Magdalena; Hladka, Iryna; Danyliv, Yan; Gražulevičius, Juozas Vidas |
Journal of publication | The Journal of organic chemistry |
Year of publication | 2019 |
Journal volume | 84 |
Journal issue | 9 |
Pages of publication | 5614 - 5626 |
a | 5.9096 ± 0.0002 Å |
b | 7.6125 ± 0.0002 Å |
c | 47.0191 ± 0.0011 Å |
α | 90° |
β | 90° |
γ | 90° |
Cell volume | 2115.24 ± 0.1 Å3 |
Cell temperature | 100.01 ± 0.1 K |
Ambient diffraction temperature | 100.01 ± 0.1 K |
Number of distinct elements | 7 |
Space group number | 19 |
Hermann-Mauguin space group symbol | P 21 21 21 |
Hall space group symbol | P 2ac 2ab |
Residual factor for all reflections | 0.0331 |
Residual factor for significantly intense reflections | 0.0307 |
Weighted residual factors for significantly intense reflections | 0.0788 |
Weighted residual factors for all reflections included in the refinement | 0.0806 |
Goodness-of-fit parameter for all reflections included in the refinement | 1.074 |
Diffraction radiation wavelength | 1.5418 Å |
Diffraction radiation type | CuKα |