Information card for entry 4034379
Formula | C23 H20 B F2 N3 O2 S |
Calculated formula | C23 H20 B F2 N3 O2 S |
SMILES | CN(C)c1ccc(cc1)C1=Nc2[n](c3c(cc(cc3)c3ccc(cc3)OC)s2)[B](O1)(F)F |
Title of publication | Application of the Suzuki-Miyaura Reaction for the Postfunctionalization of the Benzo[4,5]thiazolo[3,2- c][1,3,5,2]oxadiazaborinine Core: An Approach toward Fluorescent Dyes. |
Authors of publication | Potopnyk, Mykhaylo A.; Volyniuk, Dmytro; Luboradzki, Roman; Ceborska, Magdalena; Hladka, Iryna; Danyliv, Yan; Gražulevičius, Juozas Vidas |
Journal of publication | The Journal of organic chemistry |
Year of publication | 2019 |
Journal volume | 84 |
Journal issue | 9 |
Pages of publication | 5614 - 5626 |
a | 7.5467 ± 0.0003 Å |
b | 7.0232 ± 0.0002 Å |
c | 39.1624 ± 0.0013 Å |
α | 90° |
β | 93.585 ± 0.003° |
γ | 90° |
Cell volume | 2071.62 ± 0.12 Å3 |
Cell temperature | 100 ± 2 K |
Ambient diffraction temperature | 100 ± 2 K |
Number of distinct elements | 7 |
Space group number | 14 |
Hermann-Mauguin space group symbol | P 1 21/c 1 |
Hall space group symbol | -P 2ybc |
Residual factor for all reflections | 0.048 |
Residual factor for significantly intense reflections | 0.045 |
Weighted residual factors for significantly intense reflections | 0.1197 |
Weighted residual factors for all reflections included in the refinement | 0.1214 |
Goodness-of-fit parameter for all reflections included in the refinement | 1.119 |
Diffraction radiation wavelength | 1.54184 Å |
Diffraction radiation type | CuKα |