Information card for entry 4034419
Formula | C25 H32 N2 O6 |
Calculated formula | C25 H32 N2 O6 |
SMILES | N12[C@H](OC[C@@]1(C(=O)[C@@]1(C2=O)Cc2ccccc2N2C[C@@H](O[C@@H]([C@@H]12)C)C)C(=O)OC)C(C)(C)C |
Title of publication | Spirocyclic Tetramates by Sequential Knoevenagel and [1,5]-Prototropic Shift. |
Authors of publication | Josa-Culleré, Laia; Hirst, Michael G.; Lockett, Jonathan P.; Thompson, Amber L.; Moloney, Mark G. |
Journal of publication | The Journal of organic chemistry |
Year of publication | 2019 |
Journal volume | 84 |
Journal issue | 15 |
Pages of publication | 9671 - 9683 |
a | 9.0534 ± 0.0001 Å |
b | 11.9701 ± 0.0002 Å |
c | 22.0969 ± 0.0003 Å |
α | 90° |
β | 90° |
γ | 90° |
Cell volume | 2394.64 ± 0.06 Å3 |
Cell temperature | 150 K |
Ambient diffraction temperature | 150 K |
Number of distinct elements | 4 |
Space group number | 19 |
Hermann-Mauguin space group symbol | P 21 21 21 |
Hall space group symbol | P 2ac 2ab |
Residual factor for all reflections | 0.0329 |
Residual factor for significantly intense reflections | 0.0313 |
Weighted residual factors for all reflections | 0.0821 |
Weighted residual factors for significantly intense reflections | 0.0805 |
Weighted residual factors for all reflections included in the refinement | 0.0821 |
Goodness-of-fit parameter for all reflections included in the refinement | 0.9952 |
Diffraction radiation wavelength | 1.5418 Å |
Diffraction radiation type | CuKα |