Information card for entry 4034457
Formula | C34 H41 Cl N2 Pd |
Calculated formula | C34 H41 Cl N2 Pd |
SMILES | [Pd]1234(Cl)([cH]5[c]1([c]12[c]3(cccc1)[cH]45)C(C)(C)C)=C1N(CCN1c1c(cc(cc1C)C)C)c1c(cc(cc1C)C)C |
Title of publication | N-Heterocyclic Carbene Ligand-Controlled Chemodivergent Suzuki-Miyaura Cross Coupling. |
Authors of publication | Reeves, Emily K.; Humke, Jenna N.; Neufeldt, Sharon R. |
Journal of publication | The Journal of organic chemistry |
Year of publication | 2019 |
Journal volume | 84 |
Journal issue | 18 |
Pages of publication | 11799 - 11812 |
a | 17.0502 ± 0.0008 Å |
b | 12.2438 ± 0.0006 Å |
c | 16.2974 ± 0.0008 Å |
α | 90° |
β | 116.408 ± 0.002° |
γ | 90° |
Cell volume | 3047.2 ± 0.3 Å3 |
Cell temperature | 100 K |
Ambient diffraction temperature | 100 K |
Number of distinct elements | 5 |
Space group number | 14 |
Hermann-Mauguin space group symbol | P 1 21/c 1 |
Hall space group symbol | -P 2ybc |
Residual factor for all reflections | 0.0415 |
Residual factor for significantly intense reflections | 0.0281 |
Weighted residual factors for significantly intense reflections | 0.0636 |
Weighted residual factors for all reflections included in the refinement | 0.0686 |
Goodness-of-fit parameter for all reflections included in the refinement | 1.06 |
Diffraction radiation probe | x-ray |
Diffraction radiation wavelength | 0.71073 Å |
Diffraction radiation type | MoKα |