Information card for entry 4034488
Formula | C34 H32 O S |
Calculated formula | C34 H32 O S |
Title of publication | Synthesis and Reactivity of 5-Heterotruxenes Containing Sulfur or Nitrogen as the Heteroatom. |
Authors of publication | Górski, Krzysztof; Mech-Piskorz, Justyna; LeÅ›niewska, Barbara; Pietraszkiewicz, Oksana; Pietraszkiewicz, Marek |
Journal of publication | The Journal of organic chemistry |
Year of publication | 2019 |
Journal volume | 84 |
Journal issue | 18 |
Pages of publication | 11553 - 11561 |
a | 14.4446 ± 0.0002 Å |
b | 16.2063 ± 0.0002 Å |
c | 21.8323 ± 0.0003 Å |
α | 90° |
β | 90° |
γ | 90° |
Cell volume | 5110.8 ± 0.12 Å3 |
Cell temperature | 99.9 ± 0.2 K |
Ambient diffraction temperature | 99.9 ± 0.2 K |
Number of distinct elements | 4 |
Space group number | 61 |
Hermann-Mauguin space group symbol | P b c a |
Hall space group symbol | -P 2ac 2ab |
Residual factor for all reflections | 0.0688 |
Residual factor for significantly intense reflections | 0.0666 |
Weighted residual factors for significantly intense reflections | 0.1624 |
Weighted residual factors for all reflections included in the refinement | 0.1637 |
Goodness-of-fit parameter for all reflections included in the refinement | 1.058 |
Diffraction radiation wavelength | 1.54184 Å |
Diffraction radiation type | CuKα |