Information card for entry 4034573
Formula | C46 H64 O8 |
Calculated formula | C46 H64 O8 |
SMILES | O1C(=O)C(=C[C@@H]1[C@H](C1=CCOC1=O)C[C@H]1[C@@]2(CC[C@H]3OC(OC[C@]3([C@H]2CCC1=C)C)(C)C)C)/C=C/[C@H]1[C@]2([C@@H]([C@]3([C@H](OC(OC3)(C)C)CC2)C)CCC1=C)C |
Title of publication | Unusual <i>ent</i>-Labdane Diterpenoid Dimers and their Selective Activation of TRPV Channels. |
Authors of publication | Gao, Suyu; Wang, Dun; Chai, Hao; Xu, Jiamin; Li, Tianyu; Niu, Yingxue; Chen, Xinxin; Qiu, Feng; Li, Yang; Li, Hua; Chen, Lixia |
Journal of publication | The Journal of organic chemistry |
Year of publication | 2019 |
Journal volume | 84 |
Journal issue | 21 |
Pages of publication | 13595 - 13603 |
a | 7.14826 ± 0.00009 Å |
b | 21.3979 ± 0.0003 Å |
c | 26.9591 ± 0.0004 Å |
α | 90° |
β | 91.3181 ± 0.0012° |
γ | 90° |
Cell volume | 4122.51 ± 0.1 Å3 |
Cell temperature | 100.01 ± 0.1 K |
Ambient diffraction temperature | 100.01 ± 0.1 K |
Number of distinct elements | 3 |
Space group number | 4 |
Hermann-Mauguin space group symbol | P 1 21 1 |
Hall space group symbol | P 2yb |
Residual factor for all reflections | 0.046 |
Residual factor for significantly intense reflections | 0.0441 |
Weighted residual factors for significantly intense reflections | 0.1186 |
Weighted residual factors for all reflections included in the refinement | 0.1201 |
Goodness-of-fit parameter for all reflections included in the refinement | 1.044 |
Diffraction radiation probe | x-ray |
Diffraction radiation wavelength | 1.54184 Å |
Diffraction radiation type | CuKα |