Information card for entry 4037091
Formula | C26 H27 F3 N8 O3 S |
Calculated formula | C26 H27 F3 N8 O3 S |
SMILES | S(=O)(=O)(Nc1c2N(c3nc(N(c4nc(N(c5nc(N(c1ccc2)C)ccc5)C)ccc4)C)ccc3)C)C(F)(F)F.O |
Title of publication | Synthesis of Functionalized Azacalix[1]arene[3]pyridine Macrocycles from Cu(II)-Mediated Direct Amination Reactions of Arene through High Valent Arylcopper(III) Intermediates. |
Authors of publication | Liu, Yang; Zhang, Qian; Guo, Qing-Hui; Wang, Mei-Xiang |
Journal of publication | The Journal of organic chemistry |
Year of publication | 2016 |
Journal volume | 81 |
Journal issue | 21 |
Pages of publication | 10404 - 10410 |
a | 10.074 ± 0.003 Å |
b | 11.434 ± 0.003 Å |
c | 12.631 ± 0.004 Å |
α | 91.555 ± 0.002° |
β | 105.46 ± 0.004° |
γ | 108.834 ± 0.003° |
Cell volume | 1316.9 ± 0.7 Å3 |
Cell temperature | 173.15 K |
Ambient diffraction temperature | 173.15 K |
Number of distinct elements | 6 |
Space group number | 2 |
Hermann-Mauguin space group symbol | P -1 |
Hall space group symbol | -P 1 |
Residual factor for all reflections | 0.0636 |
Residual factor for significantly intense reflections | 0.0608 |
Weighted residual factors for significantly intense reflections | 0.1683 |
Weighted residual factors for all reflections included in the refinement | 0.1708 |
Goodness-of-fit parameter for all reflections included in the refinement | 1.111 |
Diffraction radiation wavelength | 0.71073 Å |
Diffraction radiation type | MoKα |