Information card for entry 4063950
Formula | C24 H22 Cl4 N2 O Zr |
Calculated formula | C24 H22 Cl4 N2 O Zr |
SMILES | [Zr]123456(Oc7cccc8ccc([n]1c78)C=[N]2c1c(cccc1C)C)(Cl)(Cl)[cH]1[cH]3[cH]4[cH]5[cH]61.C(Cl)Cl |
Title of publication | Syntheses, Characterization, and Ethylene Polymerization of Half-Sandwich Zirconium Complexes with Tridentate Imino−Quinolinol Ligands |
Authors of publication | Hu, Ping; Wang, Fosong; Jin, Guo-Xin |
Journal of publication | Organometallics |
Year of publication | 2011 |
Journal volume | 30 |
Journal issue | 5 |
Pages of publication | 1008 |
a | 10.307 ± 0.005 Å |
b | 11.045 ± 0.005 Å |
c | 11.929 ± 0.005 Å |
α | 98.99 ± 0.005° |
β | 108.537 ± 0.005° |
γ | 101.074 ± 0.005° |
Cell volume | 1228.6 ± 1 Å3 |
Cell temperature | 293 ± 2 K |
Ambient diffraction temperature | 293 ± 2 K |
Number of distinct elements | 6 |
Space group number | 2 |
Hermann-Mauguin space group symbol | P -1 |
Hall space group symbol | -P 1 |
Residual factor for all reflections | 0.065 |
Residual factor for significantly intense reflections | 0.0433 |
Weighted residual factors for significantly intense reflections | 0.1012 |
Weighted residual factors for all reflections included in the refinement | 0.1076 |
Goodness-of-fit parameter for all reflections included in the refinement | 0.915 |
Diffraction radiation wavelength | 0.71073 Å |
Diffraction radiation type | MoKα |