Information card for entry 4069745
Formula | C89 H156 B2 Ba2 N20 Si4 |
Calculated formula | C89 H156 B2 Ba2 N20 Si4 |
Title of publication | Tris(imidazolin-2-ylidene-1-yl)borate Complexes of the Heavier Alkaline Earths: Synthesis and Structural Studies |
Authors of publication | Arrowsmith, Merle; Heath, Alex; Hill, Michael S.; Hitchcock, Peter B.; Kociok-Köhn, Gabriele |
Journal of publication | Organometallics |
Year of publication | 2009 |
Journal volume | 28 |
Journal issue | 15 |
Pages of publication | 4550 |
a | 22.0042 ± 0.0001 Å |
b | 13.9524 ± 0.0001 Å |
c | 34.0515 ± 0.0002 Å |
α | 90° |
β | 91.565 ± 0.001° |
γ | 90° |
Cell volume | 10450.3 ± 0.11 Å3 |
Cell temperature | 150 ± 2 K |
Ambient diffraction temperature | 150 ± 2 K |
Number of distinct elements | 6 |
Space group number | 14 |
Hermann-Mauguin space group symbol | P 1 21/n 1 |
Hall space group symbol | -P 2yn |
Residual factor for all reflections | 0.0724 |
Residual factor for significantly intense reflections | 0.0399 |
Weighted residual factors for significantly intense reflections | 0.0797 |
Weighted residual factors for all reflections included in the refinement | 0.09 |
Goodness-of-fit parameter for all reflections included in the refinement | 1.019 |
Diffraction radiation wavelength | 0.71073 Å |
Diffraction radiation type | MoKα |