Information card for entry 4071480
Formula | C58 H86 Li2 N6 Zn2 |
Calculated formula | C58 H86 Li2 N6 Zn2 |
Title of publication | Synthesis, Structural Authentication, and Structurally Defined Metalation Reactions of Lithium and Sodium DA-Zincate Bases (DA = diisopropylamide) with Phenylacetylene† |
Authors of publication | Clegg, William; García-Álvarez, Joaquín; García-Álvarez, Pablo; Graham, David V.; Harrington, Ross W.; Hevia, Eva; Kennedy, Alan R.; Mulvey, Robert E.; Russo, Luca |
Journal of publication | Organometallics |
Year of publication | 2008 |
Journal volume | 27 |
Journal issue | 11 |
Pages of publication | 2654 |
a | 12.9978 ± 0.0013 Å |
b | 16.615 ± 0.002 Å |
c | 15.8875 ± 0.0017 Å |
α | 90° |
β | 118.218 ± 0.007° |
γ | 90° |
Cell volume | 3023.3 ± 0.6 Å3 |
Cell temperature | 150 ± 2 K |
Ambient diffraction temperature | 150 ± 2 K |
Number of distinct elements | 5 |
Space group number | 14 |
Hermann-Mauguin space group symbol | P 1 21/c 1 |
Hall space group symbol | -P 2ybc |
Residual factor for all reflections | 0.0404 |
Residual factor for significantly intense reflections | 0.0265 |
Weighted residual factors for significantly intense reflections | 0.0603 |
Weighted residual factors for all reflections included in the refinement | 0.0699 |
Goodness-of-fit parameter for all reflections included in the refinement | 1.108 |
Diffraction radiation wavelength | 0.71073 Å |
Diffraction radiation type | MoKα |