Information card for entry 4071835
Formula | C24 H38 Cl5 Ir N3 Rh |
Calculated formula | C24 H38 Cl5 Ir N3 Rh |
SMILES | [Ir]1234(=C5N(C(=[Rh]678(Cl)[CH]9=[CH]6CC[CH]7=[CH]8CC9)N(N5C)C)C)(Cl)(Cl)[c]5([c]1([c]2([c]3([c]45C)C)C)C)C.ClCCl |
Title of publication | Homo- and Heterodinuclear Complexes with Triazolyl-diylidene. An Easy Approach to Tandem Catalysts⊥ |
Authors of publication | Zanardi, Alessandro; Corberán, Rosa; Mata, José A.; Peris, Eduardo |
Journal of publication | Organometallics |
Year of publication | 2008 |
Journal volume | 27 |
Journal issue | 14 |
Pages of publication | 3570 |
a | 12.5908 ± 0.0004 Å |
b | 15.2228 ± 0.0006 Å |
c | 16.6788 ± 0.0006 Å |
α | 90° |
β | 106.813 ± 0.001° |
γ | 90° |
Cell volume | 3060.13 ± 0.19 Å3 |
Cell temperature | 298 ± 2 K |
Ambient diffraction temperature | 571 ± 2 K |
Number of distinct elements | 6 |
Space group number | 14 |
Hermann-Mauguin space group symbol | P 1 21/n 1 |
Hall space group symbol | -P 2yn |
Residual factor for all reflections | 0.0377 |
Residual factor for significantly intense reflections | 0.0267 |
Weighted residual factors for significantly intense reflections | 0.068 |
Weighted residual factors for all reflections included in the refinement | 0.0755 |
Goodness-of-fit parameter for all reflections included in the refinement | 1.034 |
Diffraction radiation probe | x-ray |
Diffraction radiation wavelength | 0.71073 Å |
Diffraction radiation type | MoKα |