Information card for entry 4074860
Formula | C25 H39 N Ni P2 |
Calculated formula | C25 H39 N Ni P2 |
SMILES | [Ni]12([P](C(C)C)(C(C)C)c3ccccc3N2c2ccccc2[P]1(C(C)C)C(C)C)C |
Title of publication | Amido Pincer Complexes of Nickel(II): Synthesis, Structure, and Reactivity |
Authors of publication | Liang, Lan-Chang; Chien, Pin-Shu; Lin, Jia-Ming; Huang, Mei-Hui; Huang, Yu-Lun; Liao, Ju-Hsiou |
Journal of publication | Organometallics |
Year of publication | 2006 |
Journal volume | 25 |
Journal issue | 6 |
Pages of publication | 1399 - 1411 |
a | 12.261 ± 0.0003 Å |
b | 9.935 ± 0.0002 Å |
c | 20.708 ± 0.0007 Å |
α | 90° |
β | 96.002 ± 0.001° |
γ | 90° |
Cell volume | 2508.68 ± 0.12 Å3 |
Cell temperature | 200 ± 2 K |
Ambient diffraction temperature | 200 ± 2 K |
Number of distinct elements | 5 |
Space group number | 14 |
Hermann-Mauguin space group symbol | P 1 21/c 1 |
Hall space group symbol | -P 2ybc |
Residual factor for all reflections | 0.0957 |
Residual factor for significantly intense reflections | 0.0583 |
Weighted residual factors for significantly intense reflections | 0.133 |
Weighted residual factors for all reflections included in the refinement | 0.1581 |
Goodness-of-fit parameter for all reflections included in the refinement | 1.098 |
Diffraction radiation wavelength | 0.71073 Å |
Diffraction radiation type | MoKα |