Information card for entry 4075631
Formula | C32 H42 N2 O Pd |
Calculated formula | C32 H42 N2 O Pd |
SMILES | c12c(cccc1C=[N](c1c(cccc1C(C)C)C(C)C)[Pd](C)([N](C)=Cc1ccccc1)O2)C(C)(C)C |
Title of publication | Neutral N‒O Chelated Palladium(II) Complexes: Syntheses, Characterization, and Reactivity |
Authors of publication | Kang, Myeongsoon; Sen, Ayusman |
Journal of publication | Organometallics |
Year of publication | 2005 |
Journal volume | 24 |
Journal issue | 14 |
Pages of publication | 3508 - 3515 |
a | 11.1653 ± 0.0017 Å |
b | 11.3688 ± 0.0017 Å |
c | 13.611 ± 0.002 Å |
α | 105.623 ± 0.002° |
β | 99.448 ± 0.002° |
γ | 113.062 ± 0.002° |
Cell volume | 1458.3 ± 0.4 Å3 |
Cell temperature | 98 ± 2 K |
Ambient diffraction temperature | 98 ± 2 K |
Number of distinct elements | 5 |
Space group number | 2 |
Hermann-Mauguin space group symbol | P -1 |
Hall space group symbol | -P 1 |
Residual factor for all reflections | 0.0437 |
Residual factor for significantly intense reflections | 0.0358 |
Weighted residual factors for significantly intense reflections | 0.0802 |
Weighted residual factors for all reflections included in the refinement | 0.0833 |
Goodness-of-fit parameter for all reflections included in the refinement | 1.05 |
Diffraction radiation wavelength | 0.71073 Å |
Diffraction radiation type | MoKα |