Information card for entry 4075688
Formula | C59 H60 Cl2 O2 P2 Pd2 |
Calculated formula | C59 H60 Cl1.98 O2 P2 Pd2 |
Title of publication | Investigations of Benzyl and Aryl Palladium Complexes with Pendant Hydroxy Substituents and Their Transformation into Benzolactones on Carbonylation |
Authors of publication | Lindsell, W. Edward; Palmer, Daniel D.; Preston, Peter N.; Rosair, Georgina M.; Jones, Ray V. H.; Whitton, Alan J. |
Journal of publication | Organometallics |
Year of publication | 2005 |
Journal volume | 24 |
Journal issue | 6 |
Pages of publication | 1119 |
a | 8.782 ± 0.005 Å |
b | 12.163 ± 0.005 Å |
c | 12.816 ± 0.005 Å |
α | 99.9 ± 0.005° |
β | 95.56 ± 0.005° |
γ | 103.68 ± 0.005° |
Cell volume | 1296.7 ± 1 Å3 |
Cell temperature | 160 ± 2 K |
Ambient diffraction temperature | 160 ± 2 K |
Number of distinct elements | 6 |
Space group number | 2 |
Hermann-Mauguin space group symbol | P -1 |
Hall space group symbol | -P 1 |
Residual factor for all reflections | 0.1179 |
Residual factor for significantly intense reflections | 0.1055 |
Weighted residual factors for significantly intense reflections | 0.257 |
Weighted residual factors for all reflections included in the refinement | 0.2678 |
Goodness-of-fit parameter for all reflections included in the refinement | 2.078 |
Diffraction radiation wavelength | 0.71069 Å |
Diffraction radiation type | MoKα |