Information card for entry 4075690
Formula | C46 H43 Cl4 I O P2 Pd |
Calculated formula | C46 H43 Cl4 I O P2 Pd |
Title of publication | Investigations of Benzyl and Aryl Palladium Complexes with Pendant Hydroxy Substituents and Their Transformation into Benzolactones on Carbonylation |
Authors of publication | Lindsell, W. Edward; Palmer, Daniel D.; Preston, Peter N.; Rosair, Georgina M.; Jones, Ray V. H.; Whitton, Alan J. |
Journal of publication | Organometallics |
Year of publication | 2005 |
Journal volume | 24 |
Journal issue | 6 |
Pages of publication | 1119 |
a | 10.36 ± 0.001 Å |
b | 18.713 ± 0.005 Å |
c | 23.102 ± 0.003 Å |
α | 90° |
β | 90° |
γ | 90° |
Cell volume | 4478.7 ± 1.4 Å3 |
Cell temperature | 100 ± 2 K |
Ambient diffraction temperature | 100 ± 2 K |
Number of distinct elements | 7 |
Space group number | 57 |
Hermann-Mauguin space group symbol | P b c m |
Hall space group symbol | -P 2c 2b |
Residual factor for all reflections | 0.0975 |
Residual factor for significantly intense reflections | 0.0626 |
Weighted residual factors for significantly intense reflections | 0.1417 |
Weighted residual factors for all reflections included in the refinement | 0.1621 |
Goodness-of-fit parameter for all reflections included in the refinement | 1.013 |
Diffraction radiation wavelength | 0.71073 Å |
Diffraction radiation type | MoKα |