Information card for entry 4075715
Formula | C32 H60 Mg N6 Si2 |
Calculated formula | C32 H60 Mg N6 Si2 |
SMILES | C1(CCCCC1)N([Si](C)(C)C)[Mg](N(C1CCCCC1)[Si](C)(C)C)([n]1ccc(N(C)C)cc1)[n]1ccc(N(C)C)cc1 |
Title of publication | Synthesis and Structural Characterization of Magnesium Amide Complexes Containing −N[(R)(SiMe3)] Ligands |
Authors of publication | Tang, Yongjun; Zakharov, Lev N.; Rheingold, Arnold L.; Kemp, Richard A. |
Journal of publication | Organometallics |
Year of publication | 2005 |
Journal volume | 24 |
Journal issue | 5 |
Pages of publication | 836 |
a | 10.4814 ± 0.0019 Å |
b | 18.532 ± 0.003 Å |
c | 18.641 ± 0.003 Å |
α | 90° |
β | 94.469 ± 0.003° |
γ | 90° |
Cell volume | 3609.8 ± 1.1 Å3 |
Cell temperature | 100 ± 2 K |
Ambient diffraction temperature | 100 ± 2 K |
Number of distinct elements | 5 |
Space group number | 15 |
Hermann-Mauguin space group symbol | C 1 2/c 1 |
Hall space group symbol | -C 2yc |
Residual factor for all reflections | 0.0558 |
Residual factor for significantly intense reflections | 0.0429 |
Weighted residual factors for significantly intense reflections | 0.1101 |
Weighted residual factors for all reflections included in the refinement | 0.1181 |
Goodness-of-fit parameter for all reflections included in the refinement | 1.06 |
Diffraction radiation wavelength | 0.71073 Å |
Diffraction radiation type | MoKα |