Information card for entry 4075909
Formula | C32 H32 Cl Ni P Si |
Calculated formula | C32 H32 Cl Ni P Si |
Title of publication | Indenyl-Nickel Complexes Bearing a Pendant, Hemilabile Olefin Ligand: Preparation, Characterization, and Catalytic Activities |
Authors of publication | Gareau, Daniel; Sui-Seng, Christine; Groux, Laurent F.; Brisse, François; Zargarian, Davit |
Journal of publication | Organometallics |
Year of publication | 2005 |
Journal volume | 24 |
Journal issue | 16 |
Pages of publication | 4003 |
a | 28.763 ± 0.009 Å |
b | 10.667 ± 0.01 Å |
c | 19.103 ± 0.011 Å |
α | 90° |
β | 97.44 ± 0.03° |
γ | 90° |
Cell volume | 5812 ± 7 Å3 |
Cell temperature | 203 ± 2 K |
Ambient diffraction temperature | 203 ± 2 K |
Number of distinct elements | 6 |
Space group number | 15 |
Hermann-Mauguin space group symbol | C 1 2/c 1 |
Hall space group symbol | -C 2yc |
Residual factor for all reflections | 0.1633 |
Residual factor for significantly intense reflections | 0.046 |
Weighted residual factors for significantly intense reflections | 0.1252 |
Weighted residual factors for all reflections included in the refinement | 0.1667 |
Goodness-of-fit parameter for all reflections included in the refinement | 0.802 |
Diffraction radiation wavelength | 0.71073 Å |
Diffraction radiation type | MoKα |