Information card for entry 4075976
Formula | C21 H25 B F3 N9 O4 Re S |
Calculated formula | C21 H25 B F3 N9 O4 Re S |
Title of publication | Tungsten(0) and Rhenium(I)η2-Pyrrole Complexes: Dearomatization of Pyrroles and Their Facile Isomerizations, Protonations, and Reductions |
Authors of publication | Myers, William H.; Welch, Kevin D.; Graham, Peter M.; Keller, Andrew; Sabat, Michal; Trindle, Carl O.; Harman, W. Dean |
Journal of publication | Organometallics |
Year of publication | 2005 |
Journal volume | 24 |
Journal issue | 22 |
Pages of publication | 5267 |
a | 8.0192 ± 0.0004 Å |
b | 13.0108 ± 0.0007 Å |
c | 26.3067 ± 0.0014 Å |
α | 90° |
β | 98.026 ± 0.001° |
γ | 90° |
Cell volume | 2717.9 ± 0.2 Å3 |
Cell temperature | 153 ± 2 K |
Ambient diffraction temperature | 153 ± 2 K |
Number of distinct elements | 8 |
Space group number | 14 |
Hermann-Mauguin space group symbol | P 1 21/n 1 |
Hall space group symbol | -P 2yn |
Residual factor for all reflections | 0.0492 |
Residual factor for significantly intense reflections | 0.0376 |
Weighted residual factors for significantly intense reflections | 0.0978 |
Weighted residual factors for all reflections included in the refinement | 0.1015 |
Goodness-of-fit parameter for all reflections included in the refinement | 0.985 |
Diffraction radiation wavelength | 0.71073 Å |
Diffraction radiation type | MoKα |