Information card for entry 4076186
Formula | C11 H20 Ag Cl N2 |
Calculated formula | C11 H20 Ag Cl N2 |
SMILES | [Ag](Cl)=C1N(C=CN1CC(C)C)CC(C)C |
Title of publication | Synthesis of Well-DefinedN-Heterocyclic Carbene Silver(I) Complexes |
Authors of publication | de Frémont, Pierre; Scott, Natalie M.; Stevens, Edwin D.; Ramnial, Taramatee; Lightbody, Owen C.; Macdonald, Charles L. B.; Clyburne, Jason A. C.; Abernethy, Colin D.; Nolan, Steven P. |
Journal of publication | Organometallics |
Year of publication | 2005 |
Journal volume | 24 |
Journal issue | 26 |
Pages of publication | 6301 |
a | 19.1151 ± 0.0012 Å |
b | 17.1519 ± 0.0011 Å |
c | 17.3503 ± 0.0011 Å |
α | 90° |
β | 97.118 ± 0.001° |
γ | 90° |
Cell volume | 5644.6 ± 0.6 Å3 |
Cell temperature | 150 ± 2 K |
Ambient diffraction temperature | 150 ± 2 K |
Number of distinct elements | 5 |
Space group number | 14 |
Hermann-Mauguin space group symbol | P 1 21/c 1 |
Hall space group symbol | -P 2ybc |
Residual factor for all reflections | 0.1017 |
Residual factor for significantly intense reflections | 0.0879 |
Weighted residual factors for significantly intense reflections | 0.1866 |
Weighted residual factors for all reflections included in the refinement | 0.1904 |
Goodness-of-fit parameter for all reflections included in the refinement | 1.209 |
Diffraction radiation wavelength | 0.71073 Å |
Diffraction radiation type | MoKα |