Information card for entry 4077138
Chemical name | [(m2,h1:h4:h1-(1,4-bis(2-(diphenylphosphino)ethoxy)naphthalene))2Rh2] [BF4]2 |
Formula | C309 H272 B8 Cl6 F32 O17 P16 Rh8 |
Calculated formula | C309 H272 B8 Cl6 F32 O17 P16 Rh8 |
Title of publication | Probing the Mechanistic and Energetic Basis for the Weak-Link Approach to Supramolecular Coordination Complexes |
Authors of publication | Holliday, Bradley J.; Jeon, You-Moon; Mirkin, Chad A.; Stern, Charlotte L.; Incarvito, Christopher D.; Zakharov, Lev N.; Sommer, Roger D.; Rheingold, Arnold L. |
Journal of publication | Organometallics |
Year of publication | 2002 |
Journal volume | 21 |
Journal issue | 26 |
Pages of publication | 5713 |
a | 22.986 ± 0.003 Å |
b | 30.121 ± 0.004 Å |
c | 16.062 ± 0.002 Å |
α | 90° |
β | 129.574 ± 0.002° |
γ | 90° |
Cell volume | 8571.9 ± 1.9 Å3 |
Cell temperature | 153 ± 2 K |
Ambient diffraction temperature | 153 K |
Number of distinct elements | 8 |
Space group number | 9 |
Hermann-Mauguin space group symbol | C 1 c 1 |
Hall space group symbol | C -2yc |
Residual factor for all reflections | 0.0558 |
Residual factor for significantly intense reflections | 0.0483 |
Weighted residual factors for significantly intense reflections | 0.131 |
Weighted residual factors for all reflections included in the refinement | 0.1386 |
Goodness-of-fit parameter for all reflections included in the refinement | 1.092 |
Diffraction radiation wavelength | 0.71069 Å |
Diffraction radiation type | MoKα |