Information card for entry 4077150
Formula | C8 H24 B14 Os |
Calculated formula | C8 H24 B14 Os |
SMILES | [Os]123456789%10([C]%11%12([CH]%13%142[BH]2%155[CH]51[BH]1%164[BH]43%11[BH]3%12%13[BH]%11%14%15[BH]251[BH]%1643%11)C)[CH]12[C]347(C)[BH]57%10[CH]%106[BH]6%119[BH]981[BH]123[BH]247[BH]5%106[BH]%11912 |
Title of publication | Synthetic, Structural, Chemical, and Electrochemical Studies of the Metallatricarbadecaboranyl Analogues of Ferrocene, Ruthenocene, and Osmocene and the Observation of a Reversibleη6−η4Tricarbadecaboranyl Coordination that Is Analogous to theη5−η3Cyclopentadienyl Ring-Slippage Process |
Authors of publication | Ramachandran, Bhaskar M.; Trupia, Sabrina M.; Geiger, William E.; Carroll, Patrick J.; Sneddon, Larry G. |
Journal of publication | Organometallics |
Year of publication | 2002 |
Journal volume | 21 |
Journal issue | 23 |
Pages of publication | 5078 |
a | 10.706 ± 0.003 Å |
b | 12.373 ± 0.003 Å |
c | 6.828 ± 0.002 Å |
α | 92.45 ± 0.02° |
β | 94.08 ± 0.02° |
γ | 105.7 ± 0.02° |
Cell volume | 866.7 ± 0.4 Å3 |
Cell temperature | 200 ± 2 K |
Ambient diffraction temperature | 200 ± 2 K |
Number of distinct elements | 4 |
Space group number | 2 |
Hermann-Mauguin space group symbol | P -1 |
Hall space group symbol | -P 1 |
Residual factor for all reflections | 0.0904 |
Residual factor for significantly intense reflections | 0.0784 |
Weighted residual factors for all reflections | 0.1818 |
Weighted residual factors for significantly intense reflections | 0.1709 |
Goodness-of-fit parameter for all reflections | 1.123 |
Goodness-of-fit parameter for significantly intense reflections | 1.141 |
Diffraction radiation wavelength | 0.71069 Å |
Diffraction radiation type | MoKα |