Information card for entry 4077153
Formula | C19 H29 B7 Ru |
Calculated formula | C19 H29 B7 Ru |
Title of publication | Synthetic, Structural, Chemical, and Electrochemical Studies of the Metallatricarbadecaboranyl Analogues of Ferrocene, Ruthenocene, and Osmocene and the Observation of a Reversibleη6−η4Tricarbadecaboranyl Coordination that Is Analogous to theη5−η3Cyclopentadienyl Ring-Slippage Process |
Authors of publication | Ramachandran, Bhaskar M.; Trupia, Sabrina M.; Geiger, William E.; Carroll, Patrick J.; Sneddon, Larry G. |
Journal of publication | Organometallics |
Year of publication | 2002 |
Journal volume | 21 |
Journal issue | 23 |
Pages of publication | 5078 |
a | 14.8296 ± 0.0002 Å |
b | 16.571 ± 0.0001 Å |
c | 9.7056 ± 0.0001 Å |
α | 96.141 ± 0.001° |
β | 97.725 ± 0.001° |
γ | 115.837 ± 0.001° |
Cell volume | 2090.2 ± 0.04 Å3 |
Cell temperature | 210 ± 2 K |
Ambient diffraction temperature | 210 ± 2 K |
Number of distinct elements | 4 |
Space group number | 2 |
Hermann-Mauguin space group symbol | P -1 |
Hall space group symbol | -P 1 |
Residual factor for all reflections | 0.048 |
Residual factor for significantly intense reflections | 0.0439 |
Weighted residual factors for all reflections | 0.1105 |
Weighted residual factors for significantly intense reflections | 0.1066 |
Goodness-of-fit parameter for all reflections | 1.121 |
Goodness-of-fit parameter for significantly intense reflections | 1.124 |
Diffraction radiation wavelength | 0.71069 Å |
Diffraction radiation type | MoKα |