Information card for entry 4077464
Formula | C29.5 H47 B9 Cl I N O P Ru |
Calculated formula | C29.5 H47 B9 Cl I N O P Ru |
Title of publication | Studies with the Ruthenacarborane Complex [Ru(CO)(PPh3)(THF)(η5-7,8-C2B9H11)]: Reactions with Terminal Alkynes† |
Authors of publication | Du, Shaowu; Ellis, Dianne D.; Jelliss, Paul A.; Kautz, Jason A.; Malget, John M.; Stone, F. Gordon A. |
Journal of publication | Organometallics |
Year of publication | 2000 |
Journal volume | 19 |
Journal issue | 10 |
Pages of publication | 1983 |
a | 10.1874 ± 0.0023 Å |
b | 29.2144 ± 0.0016 Å |
c | 13.2192 ± 0.0012 Å |
α | 90° |
β | 104.392 ± 0.011° |
γ | 90° |
Cell volume | 3810.8 ± 1 Å3 |
Cell temperature | 293 ± 2 K |
Ambient diffraction temperature | 293 ± 2 K |
Number of distinct elements | 9 |
Space group number | 14 |
Hermann-Mauguin space group symbol | P 1 21/c 1 |
Hall space group symbol | -P 2ybc |
Residual factor for all reflections | 0.0606 |
Residual factor for significantly intense reflections | 0.0388 |
Weighted residual factors for significantly intense reflections | 0.0786 |
Weighted residual factors for all reflections included in the refinement | 0.0891 |
Goodness-of-fit parameter for all reflections | 1.068 |
Goodness-of-fit parameter for all reflections included in the refinement | 1.077 |
Diffraction radiation wavelength | 0.71073 Å |
Diffraction radiation type | MoKα |