Information card for entry 4077609
Formula | C52 H127 Al4 Li3 N12 |
Calculated formula | C51.998 H117 Al4 Li3 N12 |
Title of publication | Entrapment oftert-Butyllithium and Lithiumtert-Butylamide Monomers by Partially Lithiated Derivatives of Aluminum and Gallium Primary Amide Complexes |
Authors of publication | Brask, Justin K.; Chivers, Tristram; Schatte, Gabriele; Yap, Glenn P. A. |
Journal of publication | Organometallics |
Year of publication | 2000 |
Journal volume | 19 |
Journal issue | 26 |
Pages of publication | 5683 |
a | 21.696 ± 0.004 Å |
b | 18.109 ± 0.003 Å |
c | 19.249 ± 0.003 Å |
α | 90° |
β | 90° |
γ | 90° |
Cell volume | 7563 ± 2 Å3 |
Cell temperature | 203 ± 2 K |
Ambient diffraction temperature | 203 ± 2 K |
Number of distinct elements | 5 |
Space group number | 29 |
Hermann-Mauguin space group symbol | P c a 21 |
Hall space group symbol | P 2c -2ac |
Residual factor for all reflections | 0.1549 |
Residual factor for significantly intense reflections | 0.108 |
Weighted residual factors for significantly intense reflections | 0.2831 |
Weighted residual factors for all reflections included in the refinement | 0.322 |
Goodness-of-fit parameter for all reflections included in the refinement | 1.119 |
Diffraction radiation wavelength | 0.71073 Å |
Diffraction radiation type | MoKα |