Information card for entry 4077692
Formula |
C33 H68 O14 S Sn6 |
Calculated formula |
C33 H67 O14 S Sn6 |
Title of publication |
Reaction of Butyltin Hydroxide Oxide withp-Toluenesulfonic Acid: Synthesis, X-ray Crystal Analysis, and Multinuclear NMR Characterization of {(BuSn)12O14(OH)6}(4-CH3C6H4SO3)2 |
Authors of publication |
Eychenne-Baron, Christophe; Ribot, François; Steunou, Nathalie; Sanchez, Clément; Fayon, Franck; Biesemans, Monique; Martins, José C.; Willem, Rudolph |
Journal of publication |
Organometallics |
Year of publication |
2000 |
Journal volume |
19 |
Journal issue |
10 |
Pages of publication |
1940 |
a |
12.722 Å |
b |
14.07 Å |
c |
16.014 Å |
α |
114.003° |
β |
96.616° |
γ |
104.237° |
Cell volume |
2462.03 Å3 |
Cell temperature |
298 K |
Ambient diffraction temperature |
298 K |
Number of distinct elements |
5 |
Space group number |
2 |
Hermann-Mauguin space group symbol |
P -1 |
Hall space group symbol |
-P 1 |
Residual factor for significantly intense reflections |
0.0326 |
Weighted residual factors for significantly intense reflections |
0.034 |
Goodness-of-fit parameter for significantly intense reflections |
2.1619 |
Diffraction radiation wavelength |
0.71069 Å |
Diffraction radiation type |
MoKα |
Yes |
No |
No |