Information card for entry 4079807
Formula | C114 H104 Cl3 F6 Fe6 In2 N7 O18 S2 |
Calculated formula | C114 H104 Cl3 F6 Fe6 In2 N7 O18 S2 |
Title of publication | Design, Synthesis, and Structural Characterization of a New Class of Ferrocene-Containing Heterometallic Triple-Stranded Helicates |
Authors of publication | Raja, Muthukrishna; Iyer, Ratnasabapathy G.; Gwengo, Chengeto; Reger, Daniel L.; Pellechia, Perry J.; Smith, Mark D.; Pascui, Andrea E. |
Journal of publication | Organometallics |
Year of publication | 2013 |
Journal volume | 32 |
Journal issue | 1 |
Pages of publication | 95 |
a | 19.2023 ± 0.0011 Å |
b | 17.9718 ± 0.0009 Å |
c | 31.0005 ± 0.0015 Å |
α | 90° |
β | 94.224 ± 0.004° |
γ | 90° |
Cell volume | 10669.2 ± 1 Å3 |
Cell temperature | 100 ± 2 K |
Ambient diffraction temperature | 100 ± 2 K |
Number of distinct elements | 9 |
Space group number | 15 |
Hermann-Mauguin space group symbol | C 1 2/c 1 |
Hall space group symbol | -C 2yc |
Residual factor for all reflections | 0.1531 |
Residual factor for significantly intense reflections | 0.0664 |
Weighted residual factors for significantly intense reflections | 0.1492 |
Weighted residual factors for all reflections included in the refinement | 0.207 |
Goodness-of-fit parameter for all reflections included in the refinement | 1.004 |
Diffraction radiation wavelength | 0.71073 Å |
Diffraction radiation type | MoKα |