Information card for entry 4085940
Formula | C24 H54 Fe P4 |
Calculated formula | C24 H54 Fe P4 |
SMILES | [Fe]([P](C)(C)C)([P](C)(C)C)([P](C)(C)C)([P](C)(C)C)(C#CC(C)(C)C)C#CC(C)(C)C |
Title of publication | High-Spin Iron(II) Alkynyl Complexes with N-Heterocyclic Carbene Ligation: Synthesis, Characterization, and Reactivity Study |
Authors of publication | Wang, Xiaojie; Zhang, Jia; Wang, Lei; Deng, Liang |
Journal of publication | Organometallics |
Year of publication | 2015 |
Journal volume | 34 |
Journal issue | 12 |
Pages of publication | 2775 |
a | 15.0186 ± 0.0014 Å |
b | 10.5172 ± 0.001 Å |
c | 20.2247 ± 0.0019 Å |
α | 90° |
β | 105.155 ± 0.002° |
γ | 90° |
Cell volume | 3083.5 ± 0.5 Å3 |
Cell temperature | 140 ± 2 K |
Ambient diffraction temperature | 140 ± 2 K |
Number of distinct elements | 4 |
Space group number | 14 |
Hermann-Mauguin space group symbol | P 1 21/c 1 |
Hall space group symbol | -P 2ybc |
Residual factor for all reflections | 0.0543 |
Residual factor for significantly intense reflections | 0.036 |
Weighted residual factors for significantly intense reflections | 0.0951 |
Weighted residual factors for all reflections included in the refinement | 0.1073 |
Goodness-of-fit parameter for all reflections included in the refinement | 1.032 |
Diffraction radiation wavelength | 0.71073 Å |
Diffraction radiation type | MoKα |