Information card for entry 4086583
Formula | C75 H102 P4 |
Calculated formula | C75 H102 P4 |
Title of publication | Synthesis of a Tris(phosphaalkene)phosphine Ligand and Fundamental Organometallic Reactions on Its Sterically Shielded Metal Complexes |
Authors of publication | Miura-Akagi, Preston M.; Nakashige, Mika L.; Maile, Caitlin K.; Oshiro, Shelly M.; Gurr, Joshua R.; Yoshida, Wesley Y.; Royappa, A. Timothy; Krause, Colleen E.; Rheingold, Arnold L.; Hughes, Russell P.; Cain, Matthew F. |
Journal of publication | Organometallics |
Year of publication | 2016 |
Journal volume | 35 |
Journal issue | 13 |
Pages of publication | 2224 |
a | 13.5848 ± 0.0005 Å |
b | 24.352 ± 0.0008 Å |
c | 23.4755 ± 0.0008 Å |
α | 90° |
β | 93.536 ± 0.002° |
γ | 90° |
Cell volume | 7751.3 ± 0.5 Å3 |
Cell temperature | 100 K |
Ambient diffraction temperature | 100 K |
Number of distinct elements | 3 |
Space group number | 14 |
Hermann-Mauguin space group symbol | P 1 21/n 1 |
Hall space group symbol | -P 2yn |
Residual factor for all reflections | 0.0609 |
Residual factor for significantly intense reflections | 0.055 |
Weighted residual factors for significantly intense reflections | 0.148 |
Weighted residual factors for all reflections included in the refinement | 0.1526 |
Goodness-of-fit parameter for all reflections included in the refinement | 1.029 |
Diffraction radiation wavelength | 1.54178 Å |
Diffraction radiation type | CuKα |